[AWS] AWS build problem
Jessica Fléchet
jessica.flechet at gmail.com
Tue Jul 25 12:09:09 CEST 2006
Hi,
I am still triing to build AWS!!! And now, after correcting some things in
project files, I have this error:
crypto_lib.gpr:42:24: warning: libraries are not supported on this platform
nossl.gpr:48:25: warning: libraries are not supported on this platform
ssl_lib.gpr:42:24: warning: libraries are not supported on this platform
gcc -c -o /cygdrive/c/projects/aws2.1/ssl/../.build/debug/ssl/obj/ssl.o
-gnatA /cygdrive/c/projects/aws2.1/ssl/ssl.ads
/cygdrive/c/projects/aws2.1/ssl/ssl.ads:0: fatal error: can't open
/cygdrive/c/projects/Temp/cc54TeIw.s for writing: No such file or directory
compilation terminated.
gnatmake: "/cygdrive/c/projects/aws2.1/ssl/ssl.ads" compilation error
make.exe[1]: *** [build] Error 4
C:\cygwin\bin\make.exe: *** [ssl_build] Error 2
What does it mean? Can someone help me with this?
Best regards,
Jessica.
-------------- next part --------------
An HTML attachment was scrubbed...
URL: /pipermail/aws/attachments/20060725/284ee3c2/attachment.html
More information about the AWS
mailing list